{"text_format":"1","workbook":"xlsx","n_sheets":22,"sheets":["Simplified Trans' Tariff Model","Network Distances","Excel Settings","Licence Agreement Wording","Licence Agreement","Original Matrix Tariff Model >>","Introduction","Legend","Excel settings-solver","Excel settings-protected cells","Versioning","Legal Disclaimer","Home","Inputs","Error report","Input-Network","Input-Throughput and bookings","Calc-Budget","Calc-Cap-Paths","Calc-Cap-Tariffs","Calc-Com","Data presentation"],"not_rendered":{"charts":3,"images":7,"macros":1,"external_links":0,"defined_names":42,"comments":1,"pivot_tables":0},"unopened":[],"bounds":{"document_bytes":16777216,"sheet_cells":100000,"rows_first":2000,"rows_last":500,"rows_between":2000,"halvings":0,"cell_chars":16384,"cell_head_chars":4096},"cells_cut":0,"cells_raw":0,"read":"whole","date_system":"1900"}

{"sheet":"Simplified Trans' Tariff Model","index":0,"n_rows":48,"n_cols":10,"rows_kept":48,"cut":false,"hidden":true,"merged":[]}
[null,null,"Simplified Transmission Tariff"]
[null,null,"Matrix RPM Model"]
[null,"Gas Year",null,null,null,"2022/23","2023/24","2024/25","2025/26","2026/27"]
[null,null,null,null,null,"published demand bookings","published demand bookings"]
[null,"Transmission Demand Bookings"]
[null,null,"Entry Commodity Bookings",null,"MWh",55772468.152999997,64621281.004337937,64621281.004337937,64621281.004337937,64621281.004337937]
[null,null,"Exit Commodity Bookings",null,"MWh",54513692.139372379,63014761.126440756,63014761.126440756,63014761.126440756,63014761.126440756]
[]
[null,null,"Entry Capacity Bookings"]
[null,null,null,"Bellanaboy","MWh",46587.228094231272,31244.815466852811,31244.815466852811,31244.815466852811,31244.815466852811]
{"$rows_left_out":39}
{"sheet":"Network Distances","index":1,"n_rows":120,"n_cols":29,"rows_kept":120,"cut":false,"hidden":true,"merged":[[11,1,15,1],[11,9,15,9],[11,17,15,17],[11,25,15,25]]}
[null,null,null,null,"Simplified Transmission Tariff"]
[null,null,null,null,"Matrix RPM Model"]
[null,"Network Distances"]
[null,"The matrices below represent the GNI network for the purpose of the required revenue element, i.e. the Bellenaboy distance excludes the Linkline element"]
[]
[null,"Shortest route (km)",null,null,null,null,null,null,null,"Offshore element of shortest route (km)",null,null,null,null,null,null,null,"Onshore element of shortest route (km)",null,null,null,null,null,null,null,"Declaration of domestic exit points"]
[null,"This matrix represents the shortest route from each entry to each exit point",null,null,null,null,null,null,null,"This matrix represents the distance gas will travel through offshore pipelines, taking the shortest path from each entry to each exit point",null,null,null,null,null,null,null,"This matrix represents the distance gas will travel through onshore pipelines, taking the shortest path from each entry to each exit point",null,null,null,null,null,null,null,"In this matrix we consider if exit points are domestic exit points, used for postalisation later"]
[]
[null,null,null,null,null,null,null,null,null,null,null,null,null,null,null,null,null,null,null,null,null,null,null,null,null,null,null,"Domestic","Non-Domestic"]
[null,null,null,"Entry points",null,null,null,null,null,null,null,"Entry points",null,null,null,null,null,null,null,"Entry points",null,null,null,null,null,null,"Count",107,2]
{"$rows_left_out":111}
{"sheet":"Excel Settings","index":2,"n_rows":29,"n_cols":5,"rows_kept":29,"cut":false,"hidden":true,"merged":[]}
[null,null,null,null,"Simplified Transmission Tariff"]
[null,null,null,null,"Matrix RPM Model"]
[null,"Excel Settings - Solver"]
[null,"Please ensure that the excel solver is enabled"]
[]
[null,"for Excel 2010"]
[null,"1. go into the Visual Basics window: tab developer, click visual basic"]
[]
[]
[]
{"$rows_left_out":20}
{"sheet":"Licence Agreement Wording","index":3,"n_rows":256,"n_cols":3,"rows_kept":256,"cut":false,"hidden":true,"merged":[]}
[]
[null,1]
[null,1,"GAS NETWORKS IRELAND"]
[null,{"$f":"B3+1","v":2}]
[null,3,"THE SIMPLIFIED TRANSMISSION TARIFF MATRIX RPM MODEL"]
[null,4,"LICENCE AGREEMENT"]
[null,5]
[null,6,"TERMS & CONDITIONS"]
[null,7]
[null,8,"                Gas Networks Ireland refers to the owner of the Simplified Transmission Tariff Matrix RPM"]
{"$rows_left_out":247}
{"sheet":"Licence Agreement","index":4,"n_rows":18,"n_cols":5,"rows_kept":18,"cut":false,"hidden":false,"merged":[]}
[null,null,null,null,"Simplified Transmission Tariff"]
[null,null,null,null,"Matrix RPM Model"]
[null,"Terms & Conditions"]
[]
[]
[]
[]
[null,null,{"$f":"IF(INDEX('Licence Agreement Wording'!C$3:C$256,'Licence Agreement Wording'!$B$2+ROWS($B$8:$B8)-1,1)=0,\"\",INDEX('Licence Agreement Wording'!C$3:C$256,'Licence Agreement Wording'!$B$2+ROWS($B$8:$B8)-1,1))","v":"GAS NETWORKS IRELAND"}]
[null,null,{"$f":"IF(INDEX('Licence Agreement Wording'!C$3:C$256,'Licence Agreement Wording'!$B$2+ROWS($B$8:$B9)-1,1)=0,\"\",INDEX('Licence Agreement Wording'!C$3:C$256,'Licence Agreement Wording'!$B$2+ROWS($B$8:$B9)-1,1))","v":""}]
[null,null,{"$f":"IF(INDEX('Licence Agreement Wording'!C$3:C$256,'Licence Agreement Wording'!$B$2+ROWS($B$8:$B10)-1,1)=0,\"\",INDEX('Licence Agreement Wording'!C$3:C$256,'Licence Agreement Wording'!$B$2+ROWS($B$8:$B10)-1,1))","v":"THE SIMPLIFIED TRANSMISSION TARIFF MATRIX RPM MODEL"}]
{"$rows_left_out":9}
{"sheet":"Original Matrix Tariff Model >>","index":5,"n_rows":0,"n_cols":0,"rows_kept":0,"cut":false,"hidden":true,"merged":[]}

{"sheet":"Introduction","index":6,"n_rows":14,"n_cols":2,"rows_kept":14,"cut":false,"hidden":true,"merged":[]}
[null,"Introduction"]
[null,"This model calculates annualised tariffs for the GNI transmission network. It is based on decisions as per CRU/19/060."]
[]
[]
[]
[]
[]
[]
[]
[]
{"$rows_left_out":5}
{"sheet":"Legend","index":7,"n_rows":12,"n_cols":3,"rows_kept":12,"cut":false,"hidden":true,"merged":[]}
[null,"Legend"]
[null,"Throughout this model data is formatted in the following way"]
[]
[null,"Format","Description"]
[null," Input","Input that can be changed by user"]
[null," Calculations","Calculations in the model or normal cells that contain links"]
[null," Results","Final results, e.g. tariffs"]
[null," Crosscheck","Used to mark cells used to check the model is working properly"]
[null," Help cells","Cells that do not contain crucial calculations, but are helpful in other ways"]
[null,"Automated values","Values that are calculated by solvers and goal-seekers"]
{"$rows_left_out":3}
{"sheet":"Excel settings-solver","index":8,"n_rows":27,"n_cols":2,"rows_kept":27,"cut":false,"hidden":true,"merged":[]}
[null,"Excel settings - Solver"]
[null,"Please ensure that the excel solver is enabled"]
[]
[null,"for Excel 2010"]
[null,"1. go into the Visual Basics window: tab developer, click visual basic"]
[]
[]
[]
[]
[]
{"$rows_left_out":18}
{"sheet":"Excel settings-protected cells","index":9,"n_rows":11,"n_cols":2,"rows_kept":11,"cut":false,"hidden":true,"merged":[]}
[null,"Excel settings - Protected cells"]
[null,"The model allows the user to change dedicated inputs, and protects the user from changing anything else."]
[]
[null,"If the user wishes to change the model, the user has to unprotect the sheets."]
[]
[]
[]
[]
[]
[]
{"$rows_left_out":2}
{"sheet":"Versioning","index":10,"n_rows":8,"n_cols":4,"rows_kept":8,"cut":false,"hidden":true,"merged":[]}
[null,"Versioning"]
[null,"This sheet contains a list of the changes made to the GNI tariff model"]
[]
[null,"Current version","2022/23"]
[]
[null,"History"]
[null,"Version","Date","Description"]
[null,"2022/23","2022-09-01","Simplified Tariff Model in line with new TAR NC Matrix RPM Model"]

{"sheet":"Legal Disclaimer","index":11,"n_rows":15,"n_cols":2,"rows_kept":15,"cut":false,"hidden":true,"merged":[]}
[null,{"$f":"CONCATENATE(Home!C5,\" Transmission Tariff Model Disclaimer\")","v":"2026/27 Transmission Tariff Model Disclaimer"}]
[]
[null,"Disclaimer"]
[null,{"$f":"CONCATENATE(\"This \",Home!C5,\" Transmission Tariff Model (including the enabling logic and input data contained therein) is made available \")","v":"This 2026/27 Transmission Tariff Model (including the enabling logic and input data contained therein) is made available "}]
[null,"as a result of the completion of the Tariff Network Code consultation process, and in order to reflect the decisions made by "]
[null,{"$f":"CONCATENATE(\"the CRU through this consultation. GNI has and shall retain exclusive ownership of the \",Home!C5,\" Transmission Tariff Model \")","v":"the CRU through this consultation. GNI has and shall retain exclusive ownership of the 2026/27 Transmission Tariff Model "}]
[null,"and all intellectual property rights in or relating to it, including the copyright and all other protected intellectual property "]
[null,"rights. The information contained in the 2019/20 TransmissionTariff Model is provided by GNI “as is” and GNI reserves the "]
[null,"right to amend the information at any time at its discretion. GNI makes no representations or warranties of any kind, express "]
[null,"or implied, in relation to the information and hereby excludes all such representations or warranties, express or implied, to "]
{"$rows_left_out":6}
{"sheet":"Home","index":12,"n_rows":38,"n_cols":9,"rows_kept":38,"cut":false,"hidden":true,"merged":[]}
[null,"Home"]
[null,"Review/insert key inputs and run the model to generate charges"]
[]
[null,"Input values"]
[null,"Year","2026/27"]
[]
[null,"Revenue",null,null,null,"Splits"]
[null,"Total Transmission Services Revenue",{"$f":"INDEX(Inputs!$C$2:$L$151,MATCH(B8,Inputs!$C$2:$C$151,0),MATCH(Home!$C$5,Inputs!$C$2:$L$2,0))","v":290127332.93270659},null,null,null,"Capacity","Commodity"]
[null,"Non-Transmission Services Revenue",{"$f":"INDEX(Inputs!$C$2:$L$151,MATCH(B9,Inputs!$C$2:$C$151,0),MATCH(Home!$C$5,Inputs!$C$2:$L$2,0))","v":239602.84331681533},"as per CRU/19/060 B.2 \"Allowed Revenue\"",null,"Capacity/commodity split",{"$f":"INDEX(Inputs!$C$2:$L$151,MATCH(F9,Inputs!$C$2:$C$151,0),MATCH(Home!$C$5,Inputs!$C$2:$L$2,0))","v":0.9},{"$f":"1-G9","v":9.9999999999999978E-2},"as per CRU/19/060 decision 5"]
[]
{"$rows_left_out":29}
{"sheet":"Inputs","index":13,"n_rows":150,"n_cols":12,"rows_kept":150,"cut":false,"hidden":true,"merged":[]}
[]
[null,"Transmission Demand",null,null,null,null,null,"2022/23",{"$f":"'Simplified Trans'' Tariff Model'!G3","v":"2023/24"},{"$f":"'Simplified Trans'' Tariff Model'!H3","v":"2024/25"},{"$f":"'Simplified Trans'' Tariff Model'!I3","v":"2025/26"},{"$f":"'Simplified Trans'' Tariff Model'!J3","v":"2026/27"}]
[]
[null,null,"Entry commodity",null,null,null,"MWh",55772468.152999997,{"$f":"'Simplified Trans'' Tariff Model'!G6","v":64621281.004337937},{"$f":"'Simplified Trans'' Tariff Model'!H6","v":64621281.004337937},{"$f":"'Simplified Trans'' Tariff Model'!I6","v":64621281.004337937},{"$f":"'Simplified Trans'' Tariff Model'!J6","v":64621281.004337937}]
[null,null,"Exit commodity",null,null,null,"MWh",54513692.139372379,{"$f":"'Simplified Trans'' Tariff Model'!G7","v":63014761.126440756},{"$f":"'Simplified Trans'' Tariff Model'!H7","v":63014761.126440756},{"$f":"'Simplified Trans'' Tariff Model'!I7","v":63014761.126440756},{"$f":"'Simplified Trans'' Tariff Model'!J7","v":63014761.126440756}]
[]
[null,null,"Bellanaboy",null,null,null,"MWh",46587.228094231272,{"$f":"'Simplified Trans'' Tariff Model'!G10","v":31244.815466852811},{"$f":"'Simplified Trans'' Tariff Model'!H10","v":31244.815466852811},{"$f":"'Simplified Trans'' Tariff Model'!I10","v":31244.815466852811},{"$f":"'Simplified Trans'' Tariff Model'!J10","v":31244.815466852811}]
[null,null,"Moffat",null,null,null,"MWh",169341.78488864272,{"$f":"'Simplified Trans'' Tariff Model'!G11","v":198486.90258305235},{"$f":"'Simplified Trans'' Tariff Model'!H11","v":198486.90258305235},{"$f":"'Simplified Trans'' Tariff Model'!I11","v":198486.90258305235},{"$f":"'Simplified Trans'' Tariff Model'!J11","v":198486.90258305235}]
[null,null,"Inch",null,null,null,"MWh",0,{"$f":"'Simplified Trans'' Tariff Model'!G12","v":0},{"$f":"'Simplified Trans'' Tariff Model'!H12","v":0},{"$f":"'Simplified Trans'' Tariff Model'!I12","v":0},{"$f":"'Simplified Trans'' Tariff Model'!J12","v":0}]
[null,null,"Inch storage",null,null,null,null,0,0,0,0,0]
{"$rows_left_out":141}
{"sheet":"Error report","index":14,"n_rows":23,"n_cols":3,"rows_kept":23,"cut":false,"hidden":true,"merged":[]}
[null,"Error report"]
[null,"This sheet contains verification of inputs and outputs"]
[]
[null,"Input checks","Results"]
[null,"Offshore and onshore routes sum up to total route",{"$f":"AND('Input-Network'!AF13:AJ121)","v":true}]
[null,"Routes all positive",{"$f":"AND(MIN('Input-Network'!$N$13:$R$121)>=0,MIN('Input-Network'!$W$13:$AA$121)>=0)","v":true}]
[]
[null,"Intermediate input checks","Results"]
[null,"Budget distribution ok",{"$f":"'Calc-Budget'!C13=Home!C8","v":true}]
[]
{"$rows_left_out":14}
{"sheet":"Input-Network","index":15,"n_rows":121,"n_cols":42,"rows_kept":121,"cut":false,"hidden":true,"merged":[[12,1,16,1],[12,10,16,10],[12,19,16,19],[12,28,16,28],[12,37,16,37]]}
[null,"Input-Network"]
[null,"The matrices below represent the GNI network for the purpose of the required revenue element, i.e. the Bellenaboy distance excludes the Linkline element"]
[null,"GNI information"]
[]
[null,null,"Shortest route (km)",null,null,null,null,null,null,null,null,"Offshore element of shortest route (km)",null,null,null,null,null,null,null,null,"Onshore element of shortest route (km)",null,null,null,null,null,null,null,null,"Route verification",null,null,null,null,null,null,null,null,"Declaration of domestic exit points"]
[null,"This matrix represents the shortest route from each",null,null,null,null,null,null,null,null,"This matrix represents the distance gas will travel",null,null,null,null,null,null,null,null,"This matrix represents the distance gas will travel",null,null,null,null,null,null,null,null,"This matrix checks whether the onshore and\n",null,null,null,null,null,null,null,null,"In this matrix we consider if exit points are domestic"]
[null,"entry to each exit point",null,null,null,null,null,null,null,null,"through offshore pipelines, taking the shortest path",null,null,null,null,null,null,null,null,"through onshore pipelines, taking the shortest path",null,null,null,null,null,null,null,null,"offshore distances add up to the total distance",null,null,null,null,null,null,null,null,"exit points, used for postalisation later"]
[null,null,null,null,null,null,null,null,null,null,"from each entry to each exit point",null,null,null,null,null,null,null,null,"from each entry to each exit point",null,null,null,null,null,null,null,null,"travelled"]
[]
[null,null,null,null,"Entry points",null,null,null,null,null,null,null,null,"Entry points",null,null,null,null,null,null,null,null,"Entry points",null,null,null,null,null,null,null,null,"Entry points",null,null,null,null,null,null,null,null,"Domestic","Non-Domestic"]
{"$rows_left_out":112}
{"sheet":"Input-Throughput and bookings","index":16,"n_rows":127,"n_cols":5,"rows_kept":127,"cut":false,"hidden":true,"merged":[]}
[null,"Input-Bookings"]
[null,"This sheet contains the projected annualised bookings on GNI's network"]
[]
[null,null,"Total throughput (MWh)"]
[null,null,"Entry commodity",{"$f":"INDEX(Inputs!$C$2:$L$151,MATCH(C5,Inputs!$C$2:$C$151,0),MATCH(Home!$C$5,Inputs!$C$2:$L$2,0))","v":64621281.004337937},"as projected by GNI"]
[null,null,"Exit commodity",{"$f":"INDEX(Inputs!$C$2:$L$151,MATCH(C6,Inputs!$C$2:$C$151,0),MATCH(Home!$C$5,Inputs!$C$2:$L$2,0))","v":63014761.126440756},"as projected by GNI"]
[]
[null,null,"Entry bookings  (MWh)"]
[null,{"$f":"'Input-Network'!E11","v":"Bellanaboy"},{"$f":"'Input-Network'!E12","v":"BELL"},{"$f":"INDEX(Inputs!$C$2:$L$151,MATCH(B9,Inputs!$C$2:$C$151,0),MATCH(Home!$C$5,Inputs!$C$2:$L$2,0))","v":31244.815466852811}]
[null,"RNG","BIOG",{"$f":"INDEX(Inputs!$C$2:$L$151,MATCH(B10,Inputs!$C$2:$C$151,0),MATCH(Home!$C$5,Inputs!$C$2:$L$2,0))","v":471.21927830051396}]
{"$rows_left_out":118}
{"sheet":"Calc-Budget","index":17,"n_rows":20,"n_cols":3,"rows_kept":20,"cut":false,"hidden":true,"merged":[]}
[null,"Calculations- budget"]
[null,"In this sheet the projected budgets to be recovered from each source are calculated"]
[]
[null,"Budget"]
[null,"Transmission Services Revenue Entry",{"$f":"Home!C8*Home!G12","v":95742019.867793187}]
[null,"Transmission Services Revenue Exit",{"$f":"Home!C8*Home!H12","v":194385313.06491339}]
[null,"Total budget",{"$f":"SUM(C5:C6)","v":290127332.93270659}]
[]
[null,"Entry capacity budget",{"$f":"C5*Home!$G$9","v":86167817.88101387}]
[null,"Exit capacity budget",{"$f":"C6*Home!$G$9","v":174946781.75842205}]
{"$rows_left_out":11}
{"sheet":"Calc-Cap-Paths","index":18,"n_rows":564,"n_cols":22,"rows_kept":564,"cut":false,"hidden":true,"merged":[[14,1,18,1]]}
[null,"Calculations-Capacity-Cost of paths"]
[null,"This sheet contains multiple steps to derive primary tariffs"]
[null,"1) In range G15:K123 the unit costs of each route are calculated based on the onshore and offshore distances multiplied by the expansion constant and annuitisation factor."]
[null,"2) In range O20:V564 we list all routes and calculate the squared difference (column V) between the unit costs of the path (column Q) and the sum of the primary tariffs (column T)."]
[null,"3) The primary tariffs are set by minimizing the sum of squared differences (V10) using a non-linear solver, launched by the macro. Using this rule the tariffs mathematically approximate the unit costs. Primary tariffs are loaded in ranges G14:K14 and F15:F123."]
[null,"4) The solver has one constraint, that the primary entry capacity revenue is 33% (V16) of the total primary capacity revenue as per CRU/19/060 decision 4."]
[]
[null,"Costs of routes based on unit costs",null,null,null,null,null,null,null,null,null,null,null,null,"Breakdown of the approximation of unit costs per path"]
[null,"as per CRU/19/060 decision 1"]
[null,null,null,null,null,null,{"$f":"'Input-Network'!E10","v":"Entry points"},null,null,null,null,null,null,null,null,null,null,null,null,null,"Total squared differences between primary tariffs and costs (to be minimized)",{"$f":"SUM(V20:V564)","v":2840550.496248656}]
{"$rows_left_out":555}
{"sheet":"Calc-Cap-Tariffs","index":19,"n_rows":140,"n_cols":21,"rows_kept":140,"cut":false,"hidden":true,"merged":[]}
[null,"Calculations-Capacity-Tariffs"]
[null,"The Primary Tariffs will not ensure that the Capacity Revenue Requirement is recovered. Therefore a value ('Adder') is added/subtracted to all Primary Tariffs to form the Secondary Tariffs such that all revenue is recovered."]
[null,"After any relevant Tariff discounts are applied to the Secondary Tariffs, the Post-Discount Tariffs will not ensure the Capacity Revenue Requirement is recovered. Therefore a value ('Post-Discount Adder') is added/subtracted"]
[null,"to all Post-Discount Tariffs to form the Tertiary Tariffs such that all revenue is recovered."]
[null,"The Final Tariffs are the sum of the Primary Tariffs, the Adder, the Discounts and the Post-Discount Adder."]
[null,"The Linkline element is added to Bellanaboy."]
[null,"Domestic exit points are equalized."]
[]
[null,"Entry tariffs"]
[]
{"$rows_left_out":131}
{"sheet":"Calc-Com","index":20,"n_rows":8,"n_cols":5,"rows_kept":8,"cut":false,"hidden":true,"merged":[]}
[null,"Calculation-Commodity charge"]
[null,"In this sheet the commodity charge is calculated by dividing the total commodity budget for entry and exit by the expected throughput."]
[]
[null,"as per CER/15/140 decision 9"]
[null,null,"Commodity charge"]
[null,null,"Budget","Throughput (MWh)","Commodity charge (€/MWh)"]
[null,"Entry",{"$f":"'Calc-Budget'!C11","v":9574201.9867793173},{"$f":"'Input-Throughput and bookings'!$D$5","v":64621281.004337937},{"$f":"C7/D7","v":0.1481586535886934}]
[null,"Exit",{"$f":"'Calc-Budget'!C12","v":19438531.306491334},{"$f":"'Input-Throughput and bookings'!$D$6","v":63014761.126440756},{"$f":"C8/D8","v":0.30847583897822634}]

{"sheet":"Data presentation","index":21,"n_rows":133,"n_cols":8,"rows_kept":133,"cut":false,"hidden":true,"merged":[[24,1,28,1]]}
[null,"Data presentation",null,null,{"$f":"Home!C5","v":"2026/27"}]
[null,"This worksheet is for presentational purposes only."]
[]
[null,"Presentation of entry capacity tariffs",null,null,null,"Entry capacity charges (€/MWh/y)"]
[null,null,null,"Required revenue element","Linkline element","Final tariff"]
[null,1,{"$f":"INDEX('Calc-Cap-Tariffs'!$C$11:$L$16,MATCH('Data presentation'!$F6,'Calc-Cap-Tariffs'!$S$11:$S$16,0),1)","v":"Bellanaboy"},{"$f":"INDEX('Calc-Cap-Tariffs'!$C$11:$S$16,MATCH('Data presentation'!$F6,'Calc-Cap-Tariffs'!$S$11:$S$16,0),14)","v":217.04990833716329},{"$f":"INDEX('Calc-Cap-Tariffs'!$C$11:$S$16,MATCH('Data presentation'!$F6,'Calc-Cap-Tariffs'!$S$11:$S$16,0),16)","v":587.64519243586778},{"$f":"LARGE('Calc-Cap-Tariffs'!$S$12:$S$16,'Data presentation'!B6)","v":804.69510077303107}]
[null,2,{"$f":"INDEX('Calc-Cap-Tariffs'!$C$11:$L$16,MATCH('Data presentation'!$F7,'Calc-Cap-Tariffs'!$S$11:$S$16,0),1)","v":"Moffat"},{"$f":"INDEX('Calc-Cap-Tariffs'!$C$11:$S$16,MATCH('Data presentation'!$F7,'Calc-Cap-Tariffs'!$S$11:$S$16,0),14)","v":399.50324842101315},{"$f":"INDEX('Calc-Cap-Tariffs'!$C$11:$S$16,MATCH('Data presentation'!$F7,'Calc-Cap-Tariffs'!$S$11:$S$16,0),16)","v":0},{"$f":"LARGE('Calc-Cap-Tariffs'!$S$12:$S$16,'Data presentation'!B7)","v":399.50324842101315}]
[null,3,{"$f":"INDEX('Calc-Cap-Tariffs'!$C$11:$L$16,MATCH('Data presentation'!$F8,'Calc-Cap-Tariffs'!$S$11:$S$16,0),1)","v":"Inch"},{"$f":"INDEX('Calc-Cap-Tariffs'!$C$11:$S$16,MATCH('Data presentation'!$F8,'Calc-Cap-Tariffs'!$S$11:$S$16,0),14)","v":203.71462253218539},{"$f":"INDEX('Calc-Cap-Tariffs'!$C$11:$S$16,MATCH('Data presentation'!$F8,'Calc-Cap-Tariffs'!$S$11:$S$16,0),16)","v":0},{"$f":"LARGE('Calc-Cap-Tariffs'!$S$12:$S$16,'Data presentation'!B8)","v":203.71462253218539}]
[null,4,{"$f":"INDEX('Calc-Cap-Tariffs'!$C$11:$L$16,MATCH('Data presentation'!$F9,'Calc-Cap-Tariffs'!$S$11:$S$16,0),1)","v":"RNG"},{"$f":"INDEX('Calc-Cap-Tariffs'!$C$11:$S$16,MATCH('Data presentation'!$F9,'Calc-Cap-Tariffs'!$S$11:$S$16,0),14)","v":190.93275914299804},{"$f":"INDEX('Calc-Cap-Tariffs'!$C$11:$S$16,MATCH('Data presentation'!$F9,'Calc-Cap-Tariffs'!$S$11:$S$16,0),16)","v":0},{"$f":"LARGE('Calc-Cap-Tariffs'!$S$12:$S$16,'Data presentation'!B9)","v":190.93275914299804}]
[null,5,{"$f":"INDEX('Calc-Cap-Tariffs'!$C$11:$L$16,MATCH('Data presentation'!$F10,'Calc-Cap-Tariffs'!$S$11:$S$16,0),1)","v":"Gormanston VRF"},{"$f":"INDEX('Calc-Cap-Tariffs'!$C$11:$S$16,MATCH('Data presentation'!$F10,'Calc-Cap-Tariffs'!$S$11:$S$16,0),14)","v":145.60000113529969},{"$f":"INDEX('Calc-Cap-Tariffs'!$C$11:$S$16,MATCH('Data presentation'!$F10,'Calc-Cap-Tariffs'!$S$11:$S$16,0),16)","v":0},{"$f":"LARGE('Calc-Cap-Tariffs'!$S$12:$S$16,'Data presentation'!B10)","v":145.60000113529969}]
{"$rows_left_out":123}